{"text_format":"1","workbook":"xlsx","n_sheets":21,"sheets":["INDEX","Stage 1.1","Stage 1.2","Stage 2.1","Stage 2.2","Stage 2.3","Stage 2.4","Stage 2.5 Std","Stage 2.5 QS","Stage 2.6","Stage 2.7","Stage 2.8","Stage 2.9","Stage 3.1","Stage 3.2","Stage 3.3","Stage 3.4","Stage 3.5","Stage 4.1","Stage 4.2","Definitions"],"not_rendered":{"charts":0,"images":0,"macros":1,"external_links":2,"defined_names":64,"comments":0,"pivot_tables":0},"unopened":[],"bounds":{"document_bytes":16777216,"sheet_cells":100000,"rows_first":2000,"rows_last":500,"rows_between":2000,"halvings":0,"cell_chars":16384,"cell_head_chars":4096},"cells_cut":0,"cells_raw":0,"read":"whole","date_system":"1900"}

{"sheet":"INDEX","index":0,"n_rows":28,"n_cols":8,"rows_kept":28,"cut":false,"hidden":false,"merged":[[0,1,0,4],[1,1,1,4]]}
[null,"SOUTH AUSTRALIA INDEPENDENT SCHOOLS BLOCK GRANT AUTHORITY"]
[null,"Round 2025 SAIS BGA Application for Capital Funding"]
[]
[null,null,"Application Help Notes"]
[]
[null,null,"STAGE 1 - NOTICE OF INTENT",null,null,null,null,"STAGE 3 FINANCIAL INFORMATION"]
[null,1.1000000000000001,"School/Campus Details",null,null,null,3.1,"Project Information and Financial Information (Refer 2.8 & 2.9)"]
[null,1.2,"Project Summary",null,null,null,3.2,"Debt Profile"]
[null,null,null,null,null,null,3.3,"Debt Details"]
[null,null,"STAGE 1 COMPLETED Upload via the BGA website ",null,null,null,3.4,"Other Balance Sheet Details"]
{"$rows_left_out":19}
{"sheet":"Stage 1.1","index":1,"n_rows":73,"n_cols":3,"rows_kept":73,"cut":false,"hidden":false,"merged":[[51,1,51,2],[72,1,72,2],[71,1,71,2],[70,1,70,2],[66,1,66,2]]}
[null,"SOUTH AUSTRALIA INDEPENDENT SCHOOLS BLOCK GRANT AUTHORITY"]
[null,"Stage 1 NOTICE OF INTENT "]
[]
[null,"1.1 Application School/Campus Detail"]
[]
[null,"Details of the School or Campus where the project will be undertaken.  "]
[null,"A) School Information"]
[null,"Australian Government Education ID (AGEID):"]
[null,"School Name:"]
[null,"Street Address:"]
{"$rows_left_out":64}
{"sheet":"Stage 1.2","index":2,"n_rows":74,"n_cols":5,"rows_kept":74,"cut":false,"hidden":false,"merged":[[2,2,2,3],[73,1,73,3],[66,1,66,2],[67,1,67,2],[68,1,68,2],[69,1,69,2],[70,1,70,2],[60,1,60,2],[62,1,62,3],[63,1,63,2],[64,1,64,2],[65,1,65,2],[55,1,55,2],[9,2,9,3],[10,2,10,3],[11,2,11,3],[74,1,74,3],[12,2,12,3],[23,1,23,2],[24,1,24,2],[52,1,52,3],[53,1,53,2],[54,1,54,2],[56,1,56,2],[57,1,57,2],[58,1,58,2],[59,1,59,2],[71,1,71,2],[72,1,72,2]]}
[null,"SOUTH AUSTRALIA INDEPENDENT SCHOOLS BLOCK GRANT AUTHORITY"]
[null,"Stage 1 NOTICE OF INTENT "]
[null,"School Name",{"$f":"'Stage 1.1'!SchoolName","v":0}]
[null,"AGEID",{"$f":"'Stage 1.1'!ageid","v":0}]
[null,"1.2 Project Details "]
[]
[null,"A) Brief Description of Proposed Project  Please refer to the Help Notes for an example \"Project Description\". "]
[null,"The details shown in the description below are automatically included in StagesE 2.1, 3.1 & 4.1. Use the buttons to view the details on those sheets. "]
[null,"Type of work involved","Describe what will be achieved"]
[]
{"$rows_left_out":65}
{"sheet":"Stage 2.1","index":3,"n_rows":27,"n_cols":3,"rows_kept":27,"cut":false,"hidden":false,"merged":[[2,2,2,3],[23,2,23,3],[8,2,8,3],[7,1,7,2]]}
[null,"SOUTH AUSTRALIA INDEPENDENT SCHOOLS BLOCK GRANT AUTHORITY"]
[null,"Stage 2 INITIAL APPLICATION"]
[null,"School Name",{"$f":"'Stage 1.1'!SchoolName","v":0}]
[null,"AGEID",{"$f":"'Stage 1.1'!ageid","v":0}]
[null,"2.1 Project Details"]
[]
[null,"A) Update the brief description of Proposed Project.  Please refer to the Help Notes for an example \"Project Description\". "]
[null,"Update the project description via Stage 1.2"]
[null,"Brief Description of project \n(from Stage 1.2)  Please update on 1.2 if necessary.",{"$f":"_xlfn.UNIQUE('Stage 1.2'!B10&\" \"&'Stage 1.2'!C10&\" \"&'Stage 1.2'!B11&\" \"&'Stage 1.2'!C11&\" \"&'Stage 1.2'!B12&\" \"&'Stage 1.2'!C12&\" \"&'Stage 1.2'!B13&\" \"&'Stage 1.2'!C13)","v":"       "}]
[null,"B) Select the Facility Types that best describe  the project (more than one can be selected)"]
{"$rows_left_out":18}
{"sheet":"Stage 2.2","index":4,"n_rows":43,"n_cols":19,"rows_kept":43,"cut":false,"hidden":false,"merged":[[2,3,2,11],[3,3,3,4]]}
[null,"SOUTH AUSTRALIA INDEPENDENT SCHOOLS BLOCK GRANT AUTHORITY"]
[null,"Stage 2 INITIAL APPLICATION"]
[null,"School Name",null,{"$f":"'Stage 1.1'!SchoolName","v":0}]
[null,"AGEID",null,{"$f":"'Stage 1.1'!ageid","v":0}]
[null,"2.2 Enrolment Information"]
[]
[null,"A) School enrolment figures - enter data in this table"]
[null,"Year",null,"Rec",1,2,3,4,5,6,7,8,9,10,11,12,"Boarding","FFPOS","R-12"]
[null,2021,"FTE",null,null,null,null,null,null,null,null,null,null,null,null,null,null,null,{"$f":"SUM(D9:P9)","v":0}]
[null,"(Census)","Streams",null,null,null,null,null,null,null,null,null,null,null,null,null,null,null,{"$f":"SUM(D10:P10)","v":0}]
{"$rows_left_out":34}
{"sheet":"Stage 2.3","index":5,"n_rows":31,"n_cols":18,"rows_kept":31,"cut":false,"hidden":false,"merged":[[2,3,2,11],[3,3,3,4],[31,1,40,17]]}
[null,"SOUTH AUSTRALIA INDEPENDENT SCHOOLS BLOCK GRANT AUTHORITY"]
[null,"Stage 2 INITIAL APPLICATION"]
[null,"School Name",null,{"$f":"'Stage 1.1'!SchoolName","v":0}]
[null,"AGEID",null,{"$f":"'Stage 1.1'!ageid","v":0}]
[null,"2.3 Enrolment Summary"]
[]
[null,"A) Enrolment Totals",null,null,null,null,null,null,null,null,null,"Progression Rate"]
[null,"Year",null,"Primary","Jnr Sec","Snr Sec","Sec","Total ","Boarding","FFPOS",null,null,null,"Primary","Jnr Sec","Snr Sec","Sec","Total "]
[null,2021,"FTE",{"$f":"'Stage 2.2'!D9+'Stage 2.2'!E9+'Stage 2.2'!F9+'Stage 2.2'!G9+'Stage 2.2'!H9+'Stage 2.2'!I9+'Stage 2.2'!J9","v":0},{"$f":"'Stage 2.2'!K9+'Stage 2.2'!L9+'Stage 2.2'!M9+'Stage 2.2'!N9","v":0},{"$f":"'Stage 2.2'!O9+'Stage 2.2'!P9","v":0},{"$f":"SUM(E9:F9)","v":0},{"$f":"D9+G9","v":0},{"$f":"'Stage 2.2'!Q9","v":0},{"$f":"'Stage 2.2'!R9","v":0}]
[null,"(Census)","Streams",{"$f":"'Stage 2.2'!D10+'Stage 2.2'!E10+'Stage 2.2'!F10+'Stage 2.2'!G10+'Stage 2.2'!H10+'Stage 2.2'!I10+'Stage 2.2'!J10","v":0},{"$f":"'Stage 2.2'!K10+'Stage 2.2'!L10+'Stage 2.2'!M10+'Stage 2.2'!N10","v":0},{"$f":"'Stage 2.2'!O10+'Stage 2.2'!P10","v":0},{"$f":"SUM(E10:F10)","v":0},{"$f":"D10+G10","v":0}]
{"$rows_left_out":22}
{"sheet":"Stage 2.4","index":6,"n_rows":93,"n_cols":14,"rows_kept":93,"cut":false,"hidden":false,"merged":[[95,1,95,2],[95,4,95,7],[92,1,92,2],[93,1,93,2],[94,1,94,2],[92,11,92,13],[93,11,93,13],[94,11,94,13],[95,11,95,13],[101,5,101,9],[93,4,93,7],[94,4,94,7],[93,8,93,10],[94,8,94,10],[95,8,95,10],[92,4,92,7],[92,8,92,10],[5,1,5,14],[91,1,91,2],[86,1,86,14],[87,1,87,13],[88,1,88,13],[90,1,90,13],[91,11,91,13],[7,2,7,13],[91,4,91,7],[91,8,91,10]]}
[null,"SOUTH AUSTRALIA INDEPENDENT SCHOOLS BLOCK GRANT AUTHORITY"]
[null,"Stage 2 INITIAL APPLICATION"]
[null,"School Name",null,{"$f":"'Stage 1.1'!SchoolName","v":0}]
[null,"AGEID",null,{"$f":"'Stage 1.1'!ageid","v":0}]
[null,"2.4 Existing Facilities & Future Facilities"]
[]
[null,"A) Existing Facilities & Future Facilities"]
[null," ","PLEASE NOTE:  Do not include the proposed project if it is for New Construction, however areas that are currently being used but are to be refurbished as part of the Proposed Project MUST be included below."]
[]
[null,null,"Facility Description","Facility ID Code","Nature of Facility","Sector","No of Units","Total Area (m2)","Condition of facilities","BER","Is facility to be used in 2024","Is facility to be used in 2026","Counted Area 2024 (m2)","Counted Area 2026 (m2)"]
{"$rows_left_out":84}
{"sheet":"Stage 2.5 Std","index":7,"n_rows":111,"n_cols":12,"rows_kept":111,"cut":false,"hidden":false,"merged":[[99,2,99,8],[100,2,100,8],[101,2,101,8],[95,2,95,4],[95,5,95,8],[96,2,96,4],[96,5,96,8],[97,2,97,8],[98,2,98,8],[92,2,92,4],[92,5,92,8],[93,2,93,4],[93,5,93,8],[94,2,94,4],[94,5,94,8],[89,2,89,4],[89,5,89,8],[90,2,90,4],[90,5,90,8],[91,2,91,4],[91,5,91,8],[85,2,85,4],[86,2,86,4],[86,5,86,8],[87,2,87,4],[88,2,88,4],[88,5,88,8],[82,2,82,4],[82,5,82,8],[83,2,83,4],[83,5,83,8],[84,2,84,4],[84,5,84,8],[79,2,79,4],[79,5,79,8],[80,2,80,4],[80,5,80,8],[81,2,81,4],[81,5,81,8],[78,2,78,11],[2,3,2,11],[3,3,3,4],[5,1,5,11],[10,2,10,11],[42,2,42,11]]}
[null,"SOUTH AUSTRALIA INDEPENDENT SCHOOLS BLOCK GRANT AUTHORITY"]
[null,"PROPOSED PROJECT AT STANDARD COST"]
[null,"School Name",null,{"$f":"'Stage 1.1'!SchoolName","v":0}]
[null,"AGEID",null,{"$f":"'Stage 1.1'!ageid","v":0}]
[]
[]
[]
[null,"A) Proposed Project - Non Teaching Spaces and Teaching Spaces for new project"]
[]
[null,"Please note:  Enter details for each facility in the relevant section e.g. Type of Work Construction or Refurbishment"]
{"$rows_left_out":102}
{"sheet":"Stage 2.5 QS","index":8,"n_rows":54,"n_cols":11,"rows_kept":54,"cut":false,"hidden":false,"merged":[[54,2,59,11],[46,2,46,7],[47,2,47,7],[23,2,23,7],[24,2,24,7],[32,2,32,7],[33,2,33,7],[36,2,36,7],[37,2,37,7],[45,2,45,7],[22,2,22,7],[31,2,31,7],[44,2,44,7],[38,2,38,7],[2,3,2,11],[3,3,3,4],[5,1,5,11],[42,2,42,7]]}
[null,"SOUTH AUSTRALIA INDEPENDENT SCHOOLS BLOCK GRANT AUTHORITY"]
[null,"PROPOSED PROJECT AS PER COST ESTIMATE BY QUANTITY SURVEYOR"]
[null,"School Name",null,{"$f":"'Stage 1.1'!SchoolName","v":0}]
[null,"AGEID",null,{"$f":"'Stage 1.1'!ageid","v":0}]
[]
[]
[]
[null,"A) Project Costs based on QS or Quotation."]
[]
[null,null,"When a QS or Quotation is available please update the section below.  Please note that a QS is Mandatory at Stage 3."]
{"$rows_left_out":45}
{"sheet":"Stage 2.6","index":9,"n_rows":32,"n_cols":13,"rows_kept":32,"cut":false,"hidden":false,"merged":[[2,3,2,11],[3,3,3,4],[5,1,5,13],[6,2,6,12],[21,2,21,5],[10,2,10,5],[13,2,13,5],[14,2,14,5],[15,2,15,5],[16,2,16,5],[18,2,18,5],[16,10,16,11],[11,2,11,5],[10,10,10,11],[11,10,11,11],[13,10,13,11],[14,10,14,11],[12,2,12,5],[32,2,32,12],[23,2,23,5],[24,2,24,5],[25,2,25,5],[26,2,26,5],[28,2,28,5],[30,2,30,5],[30,7,30,13],[22,2,22,5]]}
[null,"SOUTH AUSTRALIA INDEPENDENT SCHOOLS BLOCK GRANT AUTHORITY"]
[null,"Stage 2 INITIAL APPLICATION"]
[null,"School Name",null,{"$f":"'Stage 1.1'!SchoolName","v":0}]
[null,"AGEID",null,{"$f":"'Stage 1.1'!ageid","v":0}]
[null,"2.6 Project Funding "]
[]
[null,null,"More detail will be required from applicants invited to proceed with final project documentation.  The BGA must assess all sources of funds available to the school and requires the school to make the maximum contribution possible, including loans, without preventing the provision of an adequate level of recurrent resources or jeopardising the school's financial viability."]
[]
[null,null,"Amounts prefilled from Stage 2.5 Proposed Project",null,null,null,"QS/School Cost",null,"Standard Cost (inc Assoc Costs)",null,null,"Difference"]
[]
{"$rows_left_out":23}
{"sheet":"Stage 2.7","index":10,"n_rows":31,"n_cols":11,"rows_kept":31,"cut":false,"hidden":false,"merged":[[3,3,3,4],[1,1,1,11],[0,1,0,11],[2,3,2,10],[4,1,4,11],[14,9,14,10],[14,7,14,8],[6,6,6,8],[13,9,13,10],[13,7,13,8]]}
[null,"SOUTH AUSTRALIA INDEPENDENT SCHOOLS BLOCK GRANT AUTHORITY"]
[null,"Stage 2 INITIAL APPLICATION"]
[null,"School Name",null,{"$f":"'Stage 1.1'!SchoolName","v":0}]
[null,"AGEID",null,{"$f":"'Stage 1.1'!ageid","v":0}]
[null,"2.7 Area Summary"]
[]
[null,null,"Teaching Space Area"]
[null,null,"Not including proposed project",2024,2026,null,"Proposed Project(s) Teaching Space","Project"]
[null,null,"Primary",{"$f":"SUMIF('Stage 2.4'!$F$11:$F$85,\"Primary\",'Stage 2.4'!$M$11:$M$85)","v":0},{"$f":"SUMIF('Stage 2.4'!$F$11:$F$85,\"Primary\",'Stage 2.4'!$N$11:$N$85)","v":0},null,"Primary",{"$f":"SUMIF('Stage 2.5 Std'!E15:E39,\"Primary\",'Stage 2.5 Std'!K15:K39)","v":0}]
[null,null,"Secondary",{"$f":"SUMIF('Stage 2.4'!$F$11:$F$85,\"Secondary\",'Stage 2.4'!$M$11:$M$85)","v":0},{"$f":"SUMIF('Stage 2.4'!$F$11:$F85,\"Secondary\",'Stage 2.4'!$N$11:$N$85)","v":0},null,"Secondary",{"$f":"SUMIF('Stage 2.5 Std'!E15:E39,\"Secondary\",'Stage 2.5 Std'!K15:K39)","v":0}]
{"$rows_left_out":22}
{"sheet":"Stage 2.8","index":11,"n_rows":69,"n_cols":10,"rows_kept":69,"cut":false,"hidden":false,"merged":[[69,2,69,9],[8,2,8,3],[4,1,4,10],[6,1,6,9],[0,1,0,11],[1,1,1,11],[2,3,2,10],[3,3,3,4]]}
[null,"SOUTH AUSTRALIA INDEPENDENT SCHOOLS BLOCK GRANT AUTHORITY"]
[null,"Stage 2 INITIAL APPLICATION"]
[null,"School Name",null,{"$f":"'Stage 1.1'!SchoolName","v":0}]
[null,"AGEID",null,{"$f":"'Stage 1.1'!ageid","v":0}]
[null,"2.8 Capex Budget"]
[]
[null,"Please detail your Capex Budget, by over-typing with your own descriptions in column B.  Mark the items with an X that are part of your Master Plan. The Totals on this page flow automatically to the Stage 2.9 Financial Forecast tab. "]
[null,null,null,null,null,null,"** can be adjusted on Stage 2.5"]
[null,null,"Is this part of Master Plan",null,"2023 Actual","2024 Budget","2025 Forecast","2026 Forecast","2027 Forecast","2028 Forecast"]
[]
{"$rows_left_out":60}
{"sheet":"Stage 2.9","index":12,"n_rows":64,"n_cols":10,"rows_kept":64,"cut":false,"hidden":false,"merged":[[7,2,7,3],[64,2,64,9],[0,1,0,10],[1,1,1,10],[2,3,2,9],[3,3,3,4],[4,1,4,10],[6,1,6,9]]}
[null,"SOUTH AUSTRALIA INDEPENDENT SCHOOLS BLOCK GRANT AUTHORITY"]
[null,"Stage 2 INITIAL APPLICATION"]
[null,"School Name",null,{"$f":"'Stage 1.1'!SchoolName","v":0}]
[null,"AGEID",null,{"$f":"'Stage 1.1'!ageid","v":0}]
[null,"2.9 Financial Forecast"]
[]
[null,"Please enter data in the grey cells only.  White cells will calculate automatically.  The Capital Expenditure comes from 2.8 Capex Budget"]
[null,null,null,null,"2023 Actual","2024 Budget","2025 Forecast","2026 Forecast","2027 Forecast","2028 Forecast"]
[null,"Operations"]
[null,null,"Income"]
{"$rows_left_out":55}
{"sheet":"Stage 3.1","index":13,"n_rows":79,"n_cols":10,"rows_kept":79,"cut":false,"hidden":false,"merged":[[0,1,0,10],[1,1,1,10],[2,3,2,9],[3,3,3,4],[4,1,4,10],[7,5,7,6],[11,6,11,7],[45,1,45,9],[49,1,49,2],[53,1,53,9],[8,2,8,8],[50,1,50,2],[48,3,48,9],[48,1,48,2],[13,8,13,9],[60,1,60,9],[57,1,57,9],[64,1,64,5],[65,1,65,5],[66,1,66,5],[68,8,68,9],[63,8,63,9],[63,6,63,7],[73,1,73,9],[76,7,76,9],[67,1,67,5],[64,6,64,7],[65,6,65,7],[66,6,66,7],[67,6,67,7],[64,8,64,9],[65,8,65,9],[66,8,66,9],[67,8,67,9]]}
[null,"SOUTH AUSTRALIA INDEPENDENT SCHOOLS BLOCK GRANT AUTHORITY"]
[null,"Stage 3 FINANCIAL INFORMATION"]
[null,"School Name",null,{"$f":"'Stage 1.1'!SchoolName","v":0}]
[null,"AGEID",null,{"$f":"'Stage 1.1'!ageid","v":0}]
[null,"3.1 Project  & Financial Information"]
[]
[null,"A) Update Project Description"]
[null,null,"Has the project description changed? ",null,null,"Select from list"]
[null,"Project",{"$f":"_xlfn.UNIQUE('Stage 1.2'!$B$10&\" \"&'Stage 1.2'!$C$10&\" \"&'Stage 1.2'!$B$11&\" \"&'Stage 1.2'!$C$11&\" \"&'Stage 1.2'!$B$12&\" \"&'Stage 1.2'!$C$12&\" \"&'Stage 1.2'!$B$13&\" \"&'Stage 1.2'!$C$13)","v":"       "},null,null,null,null,null,null,"UPDATE HERE"]
[]
{"$rows_left_out":70}
{"sheet":"Stage 3.2","index":14,"n_rows":27,"n_cols":10,"rows_kept":27,"cut":false,"hidden":false,"merged":[[11,2,11,3],[17,2,17,3],[23,2,23,3],[0,1,0,10],[1,1,1,10],[2,3,2,9],[3,3,3,4],[4,1,4,10],[6,1,6,9],[7,2,7,3]]}
[null,"SOUTH AUSTRALIA INDEPENDENT SCHOOLS BLOCK GRANT AUTHORITY"]
[null,"Stage 3 FINANCIAL INFORMATION"]
[null,"School Name",null,{"$f":"'Stage 1.1'!SchoolName","v":0}]
[null,"AGEID",null,{"$f":"'Stage 1.1'!ageid","v":0}]
[null,"Stage 3.2 Debt Profile"]
[]
[null,"Please enter data in the grey cells only.  White cells will calculate automatically.  The Capital Expenditure comes from 2.8 Capex Budget"]
[null,null,null,null,2023,"2024 Budget","2025 Forecast","2026 Forecast","2027 Forecast","2028 Forecast"]
[null,"Refundable Enrolment Deposits"]
[null,"(a)","Opening balance",null,null,{"$f":"E13","v":0},{"$f":"F13","v":0},{"$f":"G13","v":0},{"$f":"H13","v":0},{"$f":"I13","v":0}]
{"$rows_left_out":18}
{"sheet":"Stage 3.3","index":15,"n_rows":39,"n_cols":11,"rows_kept":39,"cut":false,"hidden":false,"merged":[[37,3,37,4],[32,3,32,4],[33,3,33,4],[34,3,34,4],[35,3,35,4],[36,3,36,4],[25,10,26,10],[27,3,27,4],[28,3,28,4],[29,3,29,4],[30,3,30,4],[25,8,25,9],[39,1,39,10],[0,1,0,10],[1,1,1,10],[4,1,4,10],[9,10,10,10],[7,1,7,10],[9,8,9,9],[9,1,10,1],[9,2,10,2],[22,3,22,4],[9,3,10,4],[9,5,10,5],[9,6,10,6],[11,3,11,4],[12,3,12,4],[13,3,13,4],[2,2,2,8],[25,1,26,1],[25,2,26,2],[9,7,10,7],[18,3,18,4],[17,3,17,4],[25,7,26,7],[19,3,19,4],[20,3,20,4],[16,3,16,4],[14,3,14,4],[15,3,15,4],[3,2,3,3],[31,3,31,4],[24,3,24,4],[25,3,26,4],[25,5,26,5],[25,6,26,6]]}
[null,"SOUTH AUSTRALIA INDEPENDENT SCHOOLS BLOCK GRANT AUTHORITY"]
[null,"Stage 3 FINANCIAL INFORMATION"]
[null,"School Name",{"$f":"'Stage 1.1'!SchoolName","v":0}]
[null,"AGEID",{"$f":"'Stage 1.1'!ageid","v":0}]
[null,"Stage 3.3 Debt Details"]
[]
[null,"Existing Loans as at as at year ended 2023"]
[null,"Please provide details of all individual loans (including overdrafts & bridging loans) taken by the school for both operating and capital purposes. Please include SAFA Loans already approved and any applications awaiting approval. Details to include any 'back to back' loans through system offices, central funding authorities or third party financial institutions. (Insert more rows if required)"]
[null,"Please do not list any loan for the proposed project that is the subject of this grant application."]
[null,"Month & Year loan received ","Name of lending authority","Purpose to which loan has been applied",null,"Initial Loan Amount","Remaining term of loan (years)","Rate of interest %","Annual Repayment",null,"Balance outstanding"]
{"$rows_left_out":30}
{"sheet":"Stage 3.4","index":16,"n_rows":30,"n_cols":10,"rows_kept":30,"cut":false,"hidden":false,"merged":[[29,2,29,9],[22,2,22,7],[23,2,23,7],[27,2,27,7],[18,2,18,7],[19,2,19,7],[26,2,26,7],[0,1,0,10],[1,1,1,10],[4,1,4,10],[12,2,12,7],[15,2,15,7],[8,2,8,7],[2,3,2,8],[9,2,9,7],[10,2,10,7],[11,2,11,7],[7,2,7,3],[7,5,7,7],[3,3,3,4]]}
[null,"SOUTH AUSTRALIA INDEPENDENT SCHOOLS BLOCK GRANT AUTHORITY"]
[null,"Stage 3 FINANCIAL INFORMATION"]
[null,"School Name",null,{"$f":"'Stage 1.1'!SchoolName","v":0}]
[null,"AGEID",null,{"$f":"'Stage 1.1'!ageid","v":0}]
[null,"3.4  Other Balance Sheet Details"]
[]
[null,"Liquid Assets"]
[null,null,"Total of Bank Accounts",null,null,"As per Stage 2.9",null,null,{"$f":"'Stage 2.9'!E60","v":0}]
[null,null,"Cash Advances",null,null,null,null,null,0]
[null,null,"Term Deposits",null,null,null,null,null,0]
{"$rows_left_out":21}
{"sheet":"Stage 3.5","index":17,"n_rows":29,"n_cols":9,"rows_kept":29,"cut":false,"hidden":false,"merged":[[20,1,20,2],[12,1,12,2],[13,1,13,2],[0,1,0,10],[1,1,1,10],[4,1,4,10],[14,1,14,2],[16,1,16,2],[17,1,17,2],[18,1,18,2],[19,1,19,2],[3,2,3,3],[15,1,15,2]]}
[null,"SOUTH AUSTRALIA INDEPENDENT SCHOOLS BLOCK GRANT AUTHORITY"]
[null,"Stage 3 FINANCIAL INFORMATION"]
[null,"School Name",{"$f":"'Stage 1.1'!SchoolName","v":0}]
[null,"AGEID",{"$f":"'Stage 1.1'!ageid","v":0}]
[null,"3.5 Enrolment and Summary Ratios"]
[]
[]
[null,null,"Update enrolments via Stage 2.2","CLICK HERE"]
[]
[null,"Enrolments",2022,2023,"2024 Budget","2025 Forecast","2026 Forecast","2027 Forecast","2028 Forecast"]
{"$rows_left_out":20}
{"sheet":"Stage 4.1","index":18,"n_rows":52,"n_cols":10,"rows_kept":52,"cut":false,"hidden":false,"merged":[[24,2,24,6],[28,2,28,6],[12,3,14,10],[8,1,8,9],[22,2,22,5],[23,2,23,5],[19,2,19,5],[20,2,20,5],[32,2,32,5],[44,2,44,10],[33,11,33,12],[49,4,49,5],[50,4,50,5],[51,4,51,5],[48,4,48,5],[47,1,47,10],[33,2,33,5],[34,2,34,5],[35,2,35,5],[36,2,36,5],[37,2,37,5],[42,2,42,10],[45,2,45,10],[0,1,0,10],[1,1,1,10],[4,1,4,10],[18,2,18,5],[21,2,21,5],[3,2,3,3]]}
[null,"SOUTH AUSTRALIA INDEPENDENT SCHOOLS BLOCK GRANT AUTHORITY"]
[null,"Stage 4 FINAL DOCUMENTATION"]
[null,"School Name",{"$f":"'Stage 1.1'!SchoolName","v":0}]
[null,"AGEID",{"$f":"'Stage 1.1'!ageid","v":0}]
[null,"4.1 Final Project Description and Costs"]
[]
[]
[null,"UPDATE OF PROPOSED PROJECT SCHEDULE"]
[null,"Please return to Stage 2.5 and update the details of the Proposed Project to reflect the final project and costings for approval.  This is to be completed once detailed planning and designs in conjunction with your Architect, and detailed costings have been prepared.  "]
[]
{"$rows_left_out":43}
{"sheet":"Stage 4.2","index":19,"n_rows":37,"n_cols":34,"rows_kept":37,"cut":false,"hidden":false,"merged":[[30,1,30,9],[31,1,31,4],[33,1,33,4],[31,6,31,9],[33,6,33,8],[18,1,18,9],[18,30,18,39],[28,1,28,9],[28,30,28,39],[12,1,12,9],[12,30,12,39],[0,1,0,9],[1,1,1,9],[4,1,4,9],[0,30,0,39],[1,30,1,39],[4,30,4,39],[2,2,2,9],[3,2,3,3]]}
[null,"SOUTH AUSTRALIA INDEPENDENT SCHOOLS BLOCK GRANT AUTHORITY",null,null,null,null,null,null,null,null,null,null,null,null,null,null,null,null,null,null,null,null,null,null,null,null,null,null,null,null,"SOUTH AUSTRALIA INDEPENDENT SCHOOLS BLOCK GRANT AUTHORITY"]
[null,"Stage 4 FINAL DOCUMENTATION ",null,null,null,null,null,null,null,null,null,null,null,null,null,null,null,null,null,null,null,null,null,null,null,null,null,null,null,null,"Stage 4 FINAL DOCUMENTATION"]
[null,"School Name",{"$f":"'Stage 1.1'!SchoolName","v":0}]
[null,"AGEID",{"$f":"'Stage 1.1'!ageid","v":0}]
[null,"4.2.1 Financial Information Update",null,null,null,null,null,null,null,null,null,null,null,null,null,null,null,null,null,null,null,null,null,null,null,null,null,null,null,null,"4.2 Financial Update"]
[]
[null,"Please follow the links below to update the financial information previously provided. "]
[]
[null,"CAPEX Budget",null,"CLICK HERE"]
[null,null,null,null,null,null,null,null,null,null,null,null,null,null,null,null,null,null,null,null,null,null,null,null,null,null,null,null,null,null,"Please update your CAPEX Budget ",null,null,"CLICK HERE"]
{"$rows_left_out":28}
{"sheet":"Definitions","index":20,"n_rows":69,"n_cols":26,"rows_kept":69,"cut":false,"hidden":true,"merged":[[5,2,8,2],[5,3,8,3],[5,0,8,1],[5,5,8,5]]}
[null,null,"Area per student standards   Primary","m2",null,"m2"]
[null,null,"Secondary","m2",null,"m2"]
[null,null,"SEE BELOW FOR FULL DESCRIPTIONS"]
[null,null,"Area Cost Standards for January 2024 to be updated in December"]
[null,null,null,null,null,"70% of Standard Costs"]
["FUNCTIONAL AREA ID",null,"FUNCTIONAL AREA","CURRENT  COST m2 $",null,"REFURB  COST m2 $"]
[]
[]
[]
[1,"-NONE-","NONE",0,null,0,1,"-NONE-",null,null,1,"-NONE-",null,null,null,1,"-NONE-",null,null,1,"-NONE-",null,null,1,"-NONE-"]
{"$rows_left_out":59}